Target
T cell receptor alpha variable 4
Ligand
BDBM50429
Substrate
IC50
18424±n/a nM
Citation
 PubChem, PC Fluorescence-based biochemical primary high throughput dose response assay to identify inhibitors of T-cell receptor (TCR)-CD3 interaction using a TAMRA-labeled TCR probe PubChem Bioassay (2013)[AID] 
Target
Name:
T cell receptor alpha variable 4
Synonyms:
TCRAV4S1 TVA4_HUMAN
Type:
Enzyme Catalytic Domain
Mol. Mass.:
12216.28
Organism:
Homo sapiens (Human)
Description:
A0A0B4J268
Residue:
109
  
Inhibitor
Name:
BDBM50429
Synonyms:
(6E)-6-[[(3-ethyl-5-sulfanylidene-1H-1,2,4-triazol-4-yl)amino]methylidene]-4-methoxy-2-nitro-1-cyclohexa-2,4-dienone (6E)-6-[[(3-ethyl-5-sulfanylidene-1H-1,2,4-triazol-4-yl)amino]methylidene]-4-methoxy-2-nitrocyclohexa-2,4-dien-1-one 5-ethyl-4-({2-hydroxy-3-nitro-5-methoxybenzylidene}amino)-2,4-dihydro-3H-1,2,4-triazole-3-thione SMR000230376 | cid_6167174
Type:
Small organic molecule
Emp. Form.:
C12H13N5O4S
Mol. Mass.:
323.328
SMILES:
CCc1n[nH]c(=S)n1[NH+]=C[c-]1cc(OC)cc([N+]([O-])=O)c1=O
: