Target
Albumin
Ligand
BDBM61867
Substrate
IC50
>94228±n/a nM
Citation
 PubChem, PC Counterscreen for inhibitors of T-cell receptor (TCR)-CD3 interaction: Fluorescence-based biochemical high throughput dose response assay to identify inhibitors of T-cell receptor (TCR)-CD3 interaction using a TAMRA-labeled BSA probe PubChem Bioassay (2013)[AID] 
Target
Name:
Albumin
Synonyms:
ALB Serum albumin | serum albumin precursor
Type:
PROTEIN
Mol. Mass.:
69288.15
Organism:
Bos taurus
Description:
ChEMBL_1502598
Residue:
607
  
Inhibitor
Name:
BDBM61867
Synonyms:
2-(4-hydroxyphenyl)-5,6,7,8-tetrakis(oxidanyl)chromen-4-one 5,6,7,8-tetrahydroxy-2-(4-hydroxyphenyl)chromen-4-one MLS000736839 cid_96506
Type:
Small organic molecule
Emp. Form.:
C15H10O7
Mol. Mass.:
302.2357
SMILES:
Oc1ccc(cc1)-c1cc(=O)c2c(O)c(O)c(O)c(O)c2o1
: