Target
Albumin
Ligand
BDBM76224
Substrate
IC50
>94035±n/a nM
Citation
 PubChem, PC Counterscreen for inhibitors of T-cell receptor (TCR)-CD3 interaction: Fluorescence-based biochemical high throughput dose response assay to identify inhibitors of T-cell receptor (TCR)-CD3 interaction using a TAMRA-labeled BSA probe PubChem Bioassay (2013)[AID] 
Target
Name:
Albumin
Synonyms:
ALB Serum albumin | serum albumin precursor
Type:
PROTEIN
Mol. Mass.:
69288.15
Organism:
Bos taurus
Description:
ChEMBL_1502598
Residue:
607
  
Inhibitor
Name:
BDBM76224
Synonyms:
MLS001147398 N-[[(4-hydroxybenzoyl)amino]thiocarbamoyl]thiophene-2-carboxamide N-[[[(4-hydroxyphenyl)-oxomethyl]hydrazo]-sulfanylidenemethyl]-2-thiophenecarboxamide SMR000673126 | cid_1818307
Type:
Small organic molecule
Emp. Form.:
C13H11N3O3S2
Mol. Mass.:
321.375
SMILES:
Oc1ccc(cc1)C(=O)NNC(=S)NC(=O)c1cccs1
: