Target
Proto-oncogene tyrosine-protein kinase Src
Ligand
BDBM3050
Substrate
Poly(E:Y)
Meas. Tech.
Kinase Inhibition Assay
pH
7.4±n/a
Temperature
298.15±n/a K
IC50
260±n/a nM
Citation
 Boschelli, DHWu, ZKlutchko, SRShowalter, HDHamby, JMLu, GHMajor, TCDahring, TKBatley, BPanek, RLKeiser, JHartl, BGKraker, AJKlohs, WDRoberts, BJPatmore, SElliott, WLSteinkampf, RBradford, LAHallak, HDoherty, AM Synthesis and tyrosine kinase inhibitory activity of a series of 2-amino-8H-pyrido[2,3-d]pyrimidines: identification of potent, selective platelet-derived growth factor receptor tyrosine kinase inhibitors. J Med Chem 41:4365-77 (1998)  
Target
Name:
Proto-oncogene tyrosine-protein kinase Src
Synonyms:
Calmodulin/Proto-oncogene tyrosine-protein kinase Src Proto-oncogene c-Src SRC SRC_HUMAN V-src sarcoma (Schmidt-Ruppin A-2) viral oncogene homolog (avian) p60-Src | pp60c-src
Type:
Protein
Mol. Mass.:
59838.60
Organism:
Homo sapiens (Human)
Description:
P12931
Residue:
536
  
Inhibitor
Name:
BDBM3050
Synonyms:
2-Amino-6-(2,6-dichlorophenyl)-8-methylpyrido[2,3-d]pyrimidin-7(8H)-one 2-aminopyrido[2,3-d]pyrimidin-7(8H)-one 2 PD 166285 analog
Type:
Small organic molecule
Emp. Form.:
C14H10Cl2N4O
Mol. Mass.:
321.161
SMILES:
Cn1c2nc(N)ncc2cc(-c2c(Cl)cccc2Cl)c1=O
:
Substrate
Name:
Poly(E:Y)
Synonyms:
Type:
Random polymer
Mol. Mass.:
358.43
Organism:
Description:
Random copolymer of glutamic acid and tyrosine (4:1). 50 uM ATP containing 0.4 uCi of [gamma-32P]ATP as co-substrate
Residue:
3
NA