Target
Guanine nucleotide-binding protein subunit alpha-15
Ligand
BDBM96619
Substrate
EC50
19002±n/a nM
Citation
 PubChem, PC Counterscreen for agonists of the human trace amine associated receptor 1 (TAAR1): Fluorescence-based cell-based high throughput dose response assay to identify nonselective Ga16 agonists PubChem Bioassay (2013)[AID] 
Target
Name:
Guanine nucleotide-binding protein subunit alpha-15
Synonyms:
G-protein subunit alpha-16 GNA15 GNA16 | guanine nucleotide-binding protein subunit alpha-15
Type:
Protein
Mol. Mass.:
43577.62
Organism:
Homo sapiens (Human)
Description:
P30679
Residue:
374
  
Inhibitor
Name:
BDBM96619
Synonyms:
4-{[(isobutyrylamino)carbothioyl]amino}-N-(4-methoxyphenyl)benzenesulfonamide N-[[4-[(4-methoxyphenyl)sulfamoyl]anilino]-sulfanylidenemethyl]-2-methylpropanamide N-[[4-[(4-methoxyphenyl)sulfamoyl]phenyl]carbamothioyl]-2-methylpropanamide SMR000162376 | cid_1792532
Type:
Small organic molecule
Emp. Form.:
C18H21N3O4S2
Mol. Mass.:
407.507
SMILES:
COc1ccc(NS(=O)(=O)c2ccc(NC(=S)NC(=O)C(C)C)cc2)cc1
: