Target
Guanine nucleotide-binding protein subunit alpha-15
Ligand
BDBM96725
Substrate
EC50
>29940±n/a nM
Citation
 PubChem, PC Counterscreen for agonists of the human trace amine associated receptor 1 (TAAR1): Fluorescence-based cell-based high throughput dose response assay to identify nonselective Ga16 agonists PubChem Bioassay (2013)[AID] 
Target
Name:
Guanine nucleotide-binding protein subunit alpha-15
Synonyms:
G-protein subunit alpha-16 GNA15 GNA16 | guanine nucleotide-binding protein subunit alpha-15
Type:
Protein
Mol. Mass.:
43577.62
Organism:
Homo sapiens (Human)
Description:
P30679
Residue:
374
  
Inhibitor
Name:
BDBM96725
Synonyms:
2-[(E)-(2,6-dichlorobenzylidene)amino]guanidine 2-[(E)-[2,6-bis(chloranyl)phenyl]methylideneamino]guanidine MLS000736759 cid_5702063
Type:
Small organic molecule
Emp. Form.:
C8H8Cl2N4
Mol. Mass.:
231.082
SMILES:
[#7]\[#6](-[#7])=[#7]\[#7]=[#6]-c1c(Cl)cccc1Cl
: