Target
Guanine nucleotide-binding protein subunit alpha-15
Ligand
BDBM96850
Substrate
EC50
>29874±n/a nM
Citation
 PubChem, PC Counterscreen for agonists of the human trace amine associated receptor 1 (TAAR1): Fluorescence-based cell-based high throughput dose response assay to identify nonselective Ga16 agonists PubChem Bioassay (2013)[AID] 
Target
Name:
Guanine nucleotide-binding protein subunit alpha-15
Synonyms:
G-protein subunit alpha-16 GNA15 GNA16 | guanine nucleotide-binding protein subunit alpha-15
Type:
Protein
Mol. Mass.:
43577.62
Organism:
Homo sapiens (Human)
Description:
P30679
Residue:
374
  
Inhibitor
Name:
BDBM96850
Synonyms:
2-amino-N-(2-phenylethyl)-4,5,6,7-tetrahydro-1-benzothiophene-3-carboxamide 2-amino-N-phenethyl-4,5,6,7-tetrahydrobenzothiophene-3-carboxamide MLS003675888 cid_674370
Type:
Small organic molecule
Emp. Form.:
C17H20N2OS
Mol. Mass.:
300.418
SMILES:
Nc1sc2CCCCc2c1C(=O)NCCc1ccccc1
: