Target
Trace amine-associated receptor 1
Ligand
BDBM71074
Substrate
IC50
604.36±n/a nM
Citation
 PubChem, PC Counterscreen for agonists of the human trace amine associated receptor 1 (hTAAR1): Fluorescence-based cell-based high throughput dose response assay to identify hTAAR1 agonist that also desensitize TAAR1 receptor response. PubChem Bioassay (2013)[AID] 
Target
Name:
Trace amine-associated receptor 1
Synonyms:
TA1 TAAR1_HUMAN TRAR1 | trace amine-associated receptor 1
Type:
PROTEIN
Mol. Mass.:
39107.47
Organism:
Homo sapiens (Human)
Description:
ChEMBL_792734
Residue:
339
  
Inhibitor
Name:
BDBM71074
Synonyms:
5-(2-phenylethylamino)-1H-pyrimidine-2,4-dione MLS000716742 cid_309182
Type:
Small organic molecule
Emp. Form.:
C12H13N3O2
Mol. Mass.:
231.2505
SMILES:
O=c1[nH]cc(NCCc2ccccc2)c(=O)[nH]1
: