Target
Trace amine-associated receptor 1
Ligand
BDBM96725
Substrate
IC50
1173±n/a nM
Citation
 PubChem, PC Counterscreen for agonists of the human trace amine associated receptor 1 (hTAAR1): Fluorescence-based cell-based high throughput dose response assay to identify hTAAR1 agonist that also desensitize TAAR1 receptor response. PubChem Bioassay (2013)[AID] 
Target
Name:
Trace amine-associated receptor 1
Synonyms:
TA1 TAAR1_HUMAN TRAR1 | trace amine-associated receptor 1
Type:
PROTEIN
Mol. Mass.:
39107.47
Organism:
Homo sapiens (Human)
Description:
ChEMBL_792734
Residue:
339
  
Inhibitor
Name:
BDBM96725
Synonyms:
2-[(E)-(2,6-dichlorobenzylidene)amino]guanidine 2-[(E)-[2,6-bis(chloranyl)phenyl]methylideneamino]guanidine MLS000736759 cid_5702063
Type:
Small organic molecule
Emp. Form.:
C8H8Cl2N4
Mol. Mass.:
231.082
SMILES:
[#7]\[#6](-[#7])=[#7]\[#7]=[#6]-c1c(Cl)cccc1Cl
: