Target
Trace amine-associated receptor 1
Ligand
BDBM96810
Substrate
IC50
273±n/a nM
Citation
 PubChem, PC Counterscreen for agonists of the human trace amine associated receptor 1 (hTAAR1): Fluorescence-based cell-based high throughput dose response assay to identify hTAAR1 agonist that also desensitize TAAR1 receptor response. PubChem Bioassay (2013)[AID] 
Target
Name:
Trace amine-associated receptor 1
Synonyms:
TA1 TAAR1_HUMAN TRAR1 | trace amine-associated receptor 1
Type:
PROTEIN
Mol. Mass.:
39107.47
Organism:
Homo sapiens (Human)
Description:
ChEMBL_792734
Residue:
339
  
Inhibitor
Name:
BDBM96810
Synonyms:
(2-anilino-6-methyl-pyrimidin-4-yl)-dimethyl-amine MLS001360438 N4,N4,6-trimethyl-N2-phenylpyrimidine-2,4-diamine cid_718645
Type:
Small organic molecule
Emp. Form.:
C13H16N4
Mol. Mass.:
228.2929
SMILES:
CN(C)c1cc(C)nc(Nc2ccccc2)n1
: