Target
Trace amine-associated receptor 1
Ligand
BDBM96586
Substrate
EC50
916±n/a nM
Citation
 PubChem, PC Fluorescence-based cell-based high throughput dose response assay to identify agonists of the human trace amine associated receptor 1 (TAAR1) PubChem Bioassay (2013)[AID] 
Target
Name:
Trace amine-associated receptor 1
Synonyms:
TA1 TAAR1_HUMAN TRAR1 | trace amine-associated receptor 1
Type:
PROTEIN
Mol. Mass.:
39107.47
Organism:
Homo sapiens (Human)
Description:
ChEMBL_792734
Residue:
339
  
Inhibitor
Name:
BDBM96586
Synonyms:
2-[2-(cyclohexen-1-yl)ethylcarbamoyl]bicyclo[2.2.1]hept-5-ene-3-carboxylic acid MLS000107969 cid_2862533
Type:
Small organic molecule
Emp. Form.:
C17H23NO3
Mol. Mass.:
289.3694
SMILES:
[H]C12CC([H])(C=C1)C(C2C(O)=O)C(=O)NCCC1=CCCCC1
: