Target
Trace amine-associated receptor 1
Ligand
BDBM96789
Substrate
EC50
1509±n/a nM
Citation
 PubChem, PC Fluorescence-based cell-based high throughput dose response assay to identify agonists of the human trace amine associated receptor 1 (TAAR1) PubChem Bioassay (2013)[AID] 
Target
Name:
Trace amine-associated receptor 1
Synonyms:
TA1 TAAR1_HUMAN TRAR1 | trace amine-associated receptor 1
Type:
PROTEIN
Mol. Mass.:
39107.47
Organism:
Homo sapiens (Human)
Description:
ChEMBL_792734
Residue:
339
  
Inhibitor
Name:
BDBM96789
Synonyms:
MLS001082849 N-[2-(2-chlorophenyl)ethyl]-2-[3-oxidanylidene-1-(3-phenylpropyl)piperazin-2-yl]ethanamide N-[2-(2-chlorophenyl)ethyl]-2-[3-oxo-1-(3-phenylpropyl)piperazin-2-yl]acetamide cid_24816983
Type:
Small organic molecule
Emp. Form.:
C23H28ClN3O2
Mol. Mass.:
413.94
SMILES:
Clc1ccccc1CCNC(=O)CC1N(CCCc2ccccc2)CCNC1=O
: