Target
Trace amine-associated receptor 1
Ligand
BDBM96896
Substrate
EC50
>29909±n/a nM
Citation
 PubChem, PC Counterscreen for antagonists of the human trace amine associated receptor 1 (hTAAR1): Fluorescence-based cell-based high throughput dose response assay to identify TAAR1 Agonists PubChem Bioassay (2013)[AID] 
Target
Name:
Trace amine-associated receptor 1
Synonyms:
TA1 TAAR1_HUMAN TRAR1 | trace amine-associated receptor 1
Type:
PROTEIN
Mol. Mass.:
39107.47
Organism:
Homo sapiens (Human)
Description:
ChEMBL_792734
Residue:
339
  
Inhibitor
Name:
BDBM96896
Synonyms:
5-(4-methoxyphenyl)-N-(2-methylpropyl)-1,2-oxazole-3-carboxamide MLS000087048 SMR000023271 | cid_3240709
Type:
Small organic molecule
Emp. Form.:
C15H18N2O3
Mol. Mass.:
274.315
SMILES:
COc1ccc(cc1)-c1cc(no1)C(=O)NCC(C)C
: