Target
Trace amine-associated receptor 1
Ligand
BDBM96900
Substrate
EC50
>29910±n/a nM
Citation
 PubChem, PC Counterscreen for antagonists of the human trace amine associated receptor 1 (hTAAR1): Fluorescence-based cell-based high throughput dose response assay to identify TAAR1 Agonists PubChem Bioassay (2013)[AID] 
Target
Name:
Trace amine-associated receptor 1
Synonyms:
TA1 TAAR1_HUMAN TRAR1 | trace amine-associated receptor 1
Type:
PROTEIN
Mol. Mass.:
39107.47
Organism:
Homo sapiens (Human)
Description:
ChEMBL_792734
Residue:
339
  
Inhibitor
Name:
BDBM96900
Synonyms:
4-(1-oxopentylamino)-N-[4-(1-pyrrolidinylsulfonyl)phenyl]benzamide 4-(pentanoylamino)-N-[4-(1-pyrrolidinylsulfonyl)phenyl]benzamide N-(4-pyrrolidinosulfonylphenyl)-4-(valerylamino)benzamide cid_2957591
Type:
Small organic molecule
Emp. Form.:
C22H27N3O4S
Mol. Mass.:
429.532
SMILES:
CCCCC(=O)Nc1ccc(cc1)C(=O)Nc1ccc(cc1)S(=O)(=O)N1CCCC1
: