Target
Guanine nucleotide-binding protein subunit alpha-15
Ligand
BDBM96928
Substrate
IC50
>29910±n/a nM
Citation
 PubChem, PC Counterscreen for antagonists of the human trace amine associated receptor 1 (hTAAR1): Fluorescence-based cell-based high throughput dose response assay to identify nonselective Ga16 antagonists PubChem Bioassay (2013)[AID] 
Target
Name:
Guanine nucleotide-binding protein subunit alpha-15
Synonyms:
G-protein subunit alpha-16 GNA15 GNA16 | guanine nucleotide-binding protein subunit alpha-15
Type:
Protein
Mol. Mass.:
43577.62
Organism:
Homo sapiens (Human)
Description:
P30679
Residue:
374
  
Inhibitor
Name:
BDBM96928
Synonyms:
7-fluoranyl-4-(4-nitrophenyl)-3-phenyl-isoquinoline 7-fluoro-4-(4-nitrophenyl)-3-phenylisoquinoline SMR001355715 | cid_44142568
Type:
Small organic molecule
Emp. Form.:
C21H13FN2O2
Mol. Mass.:
344.3385
SMILES:
[O-][N+](=O)c1ccc(cc1)-c1c(ncc2cc(F)ccc12)-c1ccccc1
: