Target
Probable global transcription activator SNF2L2
Ligand
BDBM38858
Substrate
EC50
91155±n/a nM
Citation
 PubChem, PC Luminescence-based cell-based high throughput dose response assay to identify activators of the function of SWI/SNF related, matrix associated, actin dependent regulator of chromatin, subfamily a, member 2 (SMARCA2, BRM) PubChem Bioassay (2013)[AID] 
Target
Name:
Probable global transcription activator SNF2L2
Synonyms:
ATP-dependent helicase SMARCA2 BRG1-associated factor 190B Protein brahma homolog SMCA2_HUMAN SNF2A SWI/SNF-related matrix-associated actin-dependent regulator of chromatin subfamily A member 2 | hBRM
Type:
Enzyme Catalytic Domain
Mol. Mass.:
181290.91
Organism:
Homo sapiens (Human)
Description:
P51531
Residue:
1590
  
Inhibitor
Name:
BDBM38858
Synonyms:
MLS000035284 N-(5-methyl-1,3-thiazol-2-yl)-2-(4-pyridin-2-ylpiperazin-1-yl)acetamide N-(5-methyl-2-thiazolyl)-2-[4-(2-pyridinyl)-1-piperazinyl]acetamide SMR000000389 | cid_651072
Type:
Small organic molecule
Emp. Form.:
C15H19N5OS
Mol. Mass.:
317.409
SMILES:
Cc1cnc(NC(=O)CN2CCN(CC2)c2ccccn2)s1
: