Target
Probable global transcription activator SNF2L2
Ligand
BDBM96933
Substrate
EC50
91147±n/a nM
Citation
 PubChem, PC Luminescence-based cell-based high throughput dose response assay to identify activators of the function of SWI/SNF related, matrix associated, actin dependent regulator of chromatin, subfamily a, member 2 (SMARCA2, BRM) PubChem Bioassay (2013)[AID] 
Target
Name:
Probable global transcription activator SNF2L2
Synonyms:
ATP-dependent helicase SMARCA2 BRG1-associated factor 190B Protein brahma homolog SMCA2_HUMAN SNF2A SWI/SNF-related matrix-associated actin-dependent regulator of chromatin subfamily A member 2 | hBRM
Type:
Enzyme Catalytic Domain
Mol. Mass.:
181290.91
Organism:
Homo sapiens (Human)
Description:
P51531
Residue:
1590
  
Inhibitor
Name:
BDBM96933
Synonyms:
7-[4-(2-Methoxy-ethyl)-piperazin-1-yl]-2-(3-methoxy-phenyl)-5,6-dimethyl-pyrazolo[1,5-a]pyrimidine 7-[4-(2-methoxyethyl)piperazin-1-yl]-2-(3-methoxyphenyl)-5,6-dimethyl-pyrazolo[1,5-a]pyrimidine 7-[4-(2-methoxyethyl)piperazino]-2-(3-methoxyphenyl)-5,6-dimethyl-pyrazolo[1,5-a]pyrimidine SMR000008005 | cid_652304
Type:
Small organic molecule
Emp. Form.:
C22H29N5O2
Mol. Mass.:
395.498
SMILES:
COCCN1CCN(CC1)c1c(C)c(C)nc2cc(nn12)-c1cccc(OC)c1
: