Target
Probable global transcription activator SNF2L2
Ligand
BDBM96937
Substrate
EC50
91116±n/a nM
Citation
 PubChem, PC Luminescence-based cell-based high throughput dose response assay to identify activators of the function of SWI/SNF related, matrix associated, actin dependent regulator of chromatin, subfamily a, member 2 (SMARCA2, BRM) PubChem Bioassay (2013)[AID] 
Target
Name:
Probable global transcription activator SNF2L2
Synonyms:
ATP-dependent helicase SMARCA2 BRG1-associated factor 190B Protein brahma homolog SMCA2_HUMAN SNF2A SWI/SNF-related matrix-associated actin-dependent regulator of chromatin subfamily A member 2 | hBRM
Type:
Enzyme Catalytic Domain
Mol. Mass.:
181290.91
Organism:
Homo sapiens (Human)
Description:
P51531
Residue:
1590
  
Inhibitor
Name:
BDBM96937
Synonyms:
MLS000055617 N-[[1-chloro-2,2-bis(1-piperidinyl)ethenyl]-(dimethylamino)phosphoryl]-N-methylmethanamine SMR000060150 cid_2323738
Type:
Small organic molecule
Emp. Form.:
C16H32ClN4OP
Mol. Mass.:
362.878
SMILES:
[#6]-[#7](-[#6])P(=O)([#7](-[#6])-[#6])[#6](\Cl)=[#6](\[#7]-1-[#6]-[#6]-[#6]-[#6]-[#6]1)-[#7]-1-[#6]-[#6]-[#6]-[#6]-[#6]-1
: