Target
Probable global transcription activator SNF2L2
Ligand
BDBM70537
Substrate
EC50
91225±n/a nM
Citation
 PubChem, PC Luminescence-based cell-based high throughput dose response assay to identify activators of the function of SWI/SNF related, matrix associated, actin dependent regulator of chromatin, subfamily a, member 2 (SMARCA2, BRM) PubChem Bioassay (2013)[AID] 
Target
Name:
Probable global transcription activator SNF2L2
Synonyms:
ATP-dependent helicase SMARCA2 BRG1-associated factor 190B Protein brahma homolog SMCA2_HUMAN SNF2A SWI/SNF-related matrix-associated actin-dependent regulator of chromatin subfamily A member 2 | hBRM
Type:
Enzyme Catalytic Domain
Mol. Mass.:
181290.91
Organism:
Homo sapiens (Human)
Description:
P51531
Residue:
1590
  
Inhibitor
Name:
BDBM70537
Synonyms:
(3,5-dimethylphenyl) 2-[2-nitro-4-(trifluoromethyl)phenyl]sulfinylacetate 2-[2-nitro-4-(trifluoromethyl)phenyl]sulfinylacetic acid (3,5-dimethylphenyl) ester MLS000536416 cid_2202432
Type:
Small organic molecule
Emp. Form.:
C17H14F3NO5S
Mol. Mass.:
401.357
SMILES:
Cc1cc(C)cc(OC(=O)CS(=O)c2ccc(cc2[N+]([O-])=O)C(F)(F)F)c1
: