Target
Probable global transcription activator SNF2L2
Ligand
BDBM96969
Substrate
EC50
91101±n/a nM
Citation
 PubChem, PC Luminescence-based cell-based high throughput dose response assay to identify activators of the function of SWI/SNF related, matrix associated, actin dependent regulator of chromatin, subfamily a, member 2 (SMARCA2, BRM) PubChem Bioassay (2013)[AID] 
Target
Name:
Probable global transcription activator SNF2L2
Synonyms:
ATP-dependent helicase SMARCA2 BRG1-associated factor 190B Protein brahma homolog SMCA2_HUMAN SNF2A SWI/SNF-related matrix-associated actin-dependent regulator of chromatin subfamily A member 2 | hBRM
Type:
Enzyme Catalytic Domain
Mol. Mass.:
181290.91
Organism:
Homo sapiens (Human)
Description:
P51531
Residue:
1590
  
Inhibitor
Name:
BDBM96969
Synonyms:
(Z)-2-(1H-benzimidazol-2-yl)-3-(2-thienyl)acrylonitrile (Z)-2-(1H-benzimidazol-2-yl)-3-thiophen-2-yl-prop-2-enenitrile MLS000388791 cid_15945251
Type:
Small organic molecule
Emp. Form.:
C14H9N3S
Mol. Mass.:
251.306
SMILES:
N#C\C(=C\c1cccs1)c1nc2ccccc2[nH]1
: