Target
Probable global transcription activator SNF2L2
Ligand
BDBM50174412
Substrate
EC50
3381±n/a nM
Citation
 PubChem, PC Luminescence-based cell-based high throughput dose response assay to identify activators of the function of SWI/SNF related, matrix associated, actin dependent regulator of chromatin, subfamily a, member 2 (SMARCA2, BRM) PubChem Bioassay (2013)[AID] 
Target
Name:
Probable global transcription activator SNF2L2
Synonyms:
ATP-dependent helicase SMARCA2 BRG1-associated factor 190B Protein brahma homolog SMCA2_HUMAN SNF2A SWI/SNF-related matrix-associated actin-dependent regulator of chromatin subfamily A member 2 | hBRM
Type:
Enzyme Catalytic Domain
Mol. Mass.:
181290.91
Organism:
Homo sapiens (Human)
Description:
P51531
Residue:
1590
  
Inhibitor
Name:
BDBM50174412
Synonyms:
9-Methoxy-5,11-dimethyl-6H-pyrido[4,3-b]carbazole 9-methoxy ellipticine CHEMBL19954 cid_72512
Type:
Small organic molecule
Emp. Form.:
C18H16N2O
Mol. Mass.:
276.3324
SMILES:
COc1ccc2[nH]c3c(C)c4ccncc4c(C)c3c2c1
: