Target
Probable global transcription activator SNF2L2
Ligand
BDBM83801
Substrate
EC50
91170±n/a nM
Citation
 PubChem, PC Luminescence-based cell-based high throughput dose response assay to identify activators of the function of SWI/SNF related, matrix associated, actin dependent regulator of chromatin, subfamily a, member 2 (SMARCA2, BRM) PubChem Bioassay (2013)[AID] 
Target
Name:
Probable global transcription activator SNF2L2
Synonyms:
ATP-dependent helicase SMARCA2 BRG1-associated factor 190B Protein brahma homolog SMCA2_HUMAN SNF2A SWI/SNF-related matrix-associated actin-dependent regulator of chromatin subfamily A member 2 | hBRM
Type:
Enzyme Catalytic Domain
Mol. Mass.:
181290.91
Organism:
Homo sapiens (Human)
Description:
P51531
Residue:
1590
  
Inhibitor
Name:
BDBM83801
Synonyms:
3-(5-Furan-2-yl-2,2-dimethyl-1,4-dihydro-2H-3-oxa-7-thia-6,9,11-triaza-benzo[c]fluoren-8-ylamino)-prop an-1-ol SMR000416094 | cid_1913590
Type:
Small organic molecule
Emp. Form.:
C21H22N4O3S
Mol. Mass.:
410.489
SMILES:
CC1(C)Cc2c(CO1)c(nc1sc3c(NCCCO)ncnc3c21)-c1ccco1
: