Target
Probable global transcription activator SNF2L2
Ligand
BDBM96998
Substrate
EC50
91170±n/a nM
Citation
 PubChem, PC Luminescence-based cell-based high throughput dose response assay to identify activators of the function of SWI/SNF related, matrix associated, actin dependent regulator of chromatin, subfamily a, member 2 (SMARCA2, BRM) PubChem Bioassay (2013)[AID] 
Target
Name:
Probable global transcription activator SNF2L2
Synonyms:
ATP-dependent helicase SMARCA2 BRG1-associated factor 190B Protein brahma homolog SMCA2_HUMAN SNF2A SWI/SNF-related matrix-associated actin-dependent regulator of chromatin subfamily A member 2 | hBRM
Type:
Enzyme Catalytic Domain
Mol. Mass.:
181290.91
Organism:
Homo sapiens (Human)
Description:
P51531
Residue:
1590
  
Inhibitor
Name:
BDBM96998
Synonyms:
5-AMINO-3,6-DIHYDRO-(1,2,3)TRIAZOLO(4,5-D)PYRIMIDIN-7-ONE 5-azanyl-2,3-dihydro-[1,2,3]triazolo[4,5-d]pyrimidin-7-one SMR000112575 | cid_8646
Type:
Small organic molecule
Emp. Form.:
C4H4N6O
Mol. Mass.:
152.1142
SMILES:
Nc1nc2nn[nH]c2c(=O)[nH]1
: