Target
Probable global transcription activator SNF2L2
Ligand
BDBM96280
Substrate
EC50
91097±n/a nM
Citation
 PubChem, PC Luminescence-based cell-based high throughput dose response assay to identify activators of the function of SWI/SNF related, matrix associated, actin dependent regulator of chromatin, subfamily a, member 2 (SMARCA2, BRM) PubChem Bioassay (2013)[AID] 
Target
Name:
Probable global transcription activator SNF2L2
Synonyms:
ATP-dependent helicase SMARCA2 BRG1-associated factor 190B Protein brahma homolog SMCA2_HUMAN SNF2A SWI/SNF-related matrix-associated actin-dependent regulator of chromatin subfamily A member 2 | hBRM
Type:
Enzyme Catalytic Domain
Mol. Mass.:
181290.91
Organism:
Homo sapiens (Human)
Description:
P51531
Residue:
1590
  
Inhibitor
Name:
BDBM96280
Synonyms:
MLS002246639 N-(3-carbamoyl-2-thienyl)-5-nitro-2-furamide N-(3-carbamoylthiophen-2-yl)-5-nitrofuran-2-carboxamide cid_4852862
Type:
Small organic molecule
Emp. Form.:
C10H7N3O5S
Mol. Mass.:
281.245
SMILES:
NC(=O)c1ccsc1NC(=O)c1ccc(o1)[N+]([O-])=O
: