Target
Probable global transcription activator SNF2L2
Ligand
BDBM89181
Substrate
EC50
11366±n/a nM
Citation
 PubChem, PC Luminescence-based cell-based high throughput dose response assay to identify activators of the function of SWI/SNF related, matrix associated, actin dependent regulator of chromatin, subfamily a, member 2 (SMARCA2, BRM) PubChem Bioassay (2013)[AID] 
Target
Name:
Probable global transcription activator SNF2L2
Synonyms:
ATP-dependent helicase SMARCA2 BRG1-associated factor 190B Protein brahma homolog SMCA2_HUMAN SNF2A SWI/SNF-related matrix-associated actin-dependent regulator of chromatin subfamily A member 2 | hBRM
Type:
Enzyme Catalytic Domain
Mol. Mass.:
181290.91
Organism:
Homo sapiens (Human)
Description:
P51531
Residue:
1590
  
Inhibitor
Name:
BDBM89181
Synonyms:
2,7-bis[2-(diethylamino)ethoxy]-9-fluorenone oxime;hydrochloride MLS000518859 SMR000129279 | cid_9550556
Type:
Small organic molecule
Emp. Form.:
C25H35N3O3
Mol. Mass.:
425.5637
SMILES:
CCN(CC)CCOc1ccc-2c(c1)C(N=O)c1cc(OCCN(CC)CC)ccc-21
: