Target
Trace amine-associated receptor 1
Ligand
BDBM96912
Substrate
IC50
3167±n/a nM
Citation
 PubChem, PC Fluorescence-based cell-based high throughput dose response assay to identify antagonists of the human trace amine associated receptor 1 (TAAR1) PubChem Bioassay (2013)[AID] 
Target
Name:
Trace amine-associated receptor 1
Synonyms:
TA1 TAAR1_HUMAN TRAR1 | trace amine-associated receptor 1
Type:
PROTEIN
Mol. Mass.:
39107.47
Organism:
Homo sapiens (Human)
Description:
ChEMBL_792734
Residue:
339
  
Inhibitor
Name:
BDBM96912
Synonyms:
7-(4-fluorophenyl)-4-(4-methyl-1-piperazinyl)-5-phenylpyrrolo[2,3-d]pyrimidine 7-(4-fluorophenyl)-4-(4-methylpiperazin-1-yl)-5-phenyl-pyrrolo[2,3-d]pyrimidine 7-(4-fluorophenyl)-4-(4-methylpiperazino)-5-phenyl-pyrrolo[2,3-d]pyrimidine SMR000310960 | cid_1522618
Type:
Small organic molecule
Emp. Form.:
C23H22FN5
Mol. Mass.:
387.4527
SMILES:
CN1CCN(CC1)c1ncnc2n(cc(-c3ccccc3)c12)-c1ccc(F)cc1
: