Target
Galanin receptor type 3
Ligand
BDBM3256
Substrate
IC50
1251±n/a nM
Citation
 PubChem, PC Fluorescence-based cell-based primary high throughput dose response assay to identify antagonists of the Galanin Receptor 3 (GalR3). PubChem Bioassay (2013)[AID] 
Target
Name:
Galanin receptor type 3
Synonyms:
GALNR3 GALR3_HUMAN Galanin receptor 3 | Galanin receptor type 3
Type:
Enzyme Catalytic Domain
Mol. Mass.:
39599.97
Organism:
Homo sapiens (Human)
Description:
Galanin R3 GALR3 HUMAN::O60755
Residue:
368
  
Inhibitor
Name:
BDBM3256
Synonyms:
4-(Benzylamino)quinazoline deriv. 7 benzyl(quinazolin-4-yl)amine;hydrochloride | cid_616573
Type:
Small organic molecule
Emp. Form.:
C15H13N3
Mol. Mass.:
235.2838
SMILES:
C(Nc1ncnc2ccccc12)c1ccccc1
: