Target
Galanin receptor type 3
Ligand
BDBM97105
Substrate
IC50
>29910±n/a nM
Citation
 PubChem, PC Fluorescence-based cell-based primary high throughput dose response assay to identify antagonists of the Galanin Receptor 3 (GalR3). PubChem Bioassay (2013)[AID] 
Target
Name:
Galanin receptor type 3
Synonyms:
GALNR3 GALR3_HUMAN Galanin receptor 3 | Galanin receptor type 3
Type:
Enzyme Catalytic Domain
Mol. Mass.:
39599.97
Organism:
Homo sapiens (Human)
Description:
Galanin R3 GALR3 HUMAN::O60755
Residue:
368
  
Inhibitor
Name:
BDBM97105
Synonyms:
2-(1-adamantyl)-4-chloranyl-5-(oxolan-2-ylmethylamino)pyridazin-3-one 2-(1-adamantyl)-4-chloro-5-(oxolan-2-ylmethylamino)pyridazin-3-one 2-(1-adamantyl)-4-chloro-5-[(tetrahydrofuran-2-ylmethyl)amino]pyridazin-3(2H)-one SMR000308943 | cid_16193721
Type:
Small organic molecule
Emp. Form.:
C19H26ClN3O2
Mol. Mass.:
363.882
SMILES:
[H]C12CC3([H])CC([H])(C1)CC(C2)(C3)n1ncc(NCC2CCCO2)c(Cl)c1=O
: