Target
Galanin receptor type 3
Ligand
BDBM62272
Substrate
IC50
143±n/a nM
Citation
 PubChem, PC Fluorescence-based cell-based primary high throughput dose response assay to identify antagonists of the Galanin Receptor 3 (GalR3). PubChem Bioassay (2013)[AID] 
Target
Name:
Galanin receptor type 3
Synonyms:
GALNR3 GALR3_HUMAN Galanin receptor 3 | Galanin receptor type 3
Type:
Enzyme Catalytic Domain
Mol. Mass.:
39599.97
Organism:
Homo sapiens (Human)
Description:
Galanin R3 GALR3 HUMAN::O60755
Residue:
368
  
Inhibitor
Name:
BDBM62272
Synonyms:
MLS-0375912.0001 N-[1-(4-tert-butylphenyl)-4,5,6,7-tetrahydroindazol-4-yl]-2-methyl-pyrazole-3-carboxamide cid_24793159
Type:
Small organic molecule
Emp. Form.:
C22H27N5O
Mol. Mass.:
377.4827
SMILES:
Cn1nccc1C(=O)NC1CCCc2c1cnn2-c1ccc(cc1)C(C)(C)C
: