Target
Galanin receptor type 3
Ligand
BDBM97183
Substrate
IC50
348.52±n/a nM
Citation
 PubChem, PC Fluorescence-based cell-based primary high throughput dose response assay to identify antagonists of the Galanin Receptor 3 (GalR3). PubChem Bioassay (2013)[AID] 
Target
Name:
Galanin receptor type 3
Synonyms:
GALNR3 GALR3_HUMAN Galanin receptor 3 | Galanin receptor type 3
Type:
Enzyme Catalytic Domain
Mol. Mass.:
39599.97
Organism:
Homo sapiens (Human)
Description:
Galanin R3 GALR3 HUMAN::O60755
Residue:
368
  
Inhibitor
Name:
BDBM97183
Synonyms:
MLS003120814 [(2S,6R)-6-[6-(cyclopentylamino)-9-purinyl]-4-[(4-phenylphenyl)methyl]-2-morpholinyl]methanol [(2S,6R)-6-[6-(cyclopentylamino)purin-9-yl]-4-[(4-phenylphenyl)methyl]morpholin-2-yl]methanol | cid_49778246
Type:
Small organic molecule
Emp. Form.:
C28H32N6O2
Mol. Mass.:
484.5927
SMILES:
OC[C@@H]1CN(Cc2ccc(cc2)-c2ccccc2)C[C@@H](O1)n1cnc2c(NC3CCCC3)ncnc12
: