Target
Mast/stem cell growth factor receptor Kit
Ligand
BDBM239041
Substrate
Meas. Tech.
KIT Kinase Biochemical Assay
pH
7.9±n/a
IC50
180±n/a nM
Comments
extracted
Citation
 Lombardi Borgia, ACiomei, MDonati, DNesi, M Substituted indazole derivatives active as kinase inhibitiors US Patent  US10028934 Publication Date 7/24/2018 
Target
Name:
Mast/stem cell growth factor receptor Kit
Synonyms:
CD117 antigen KIT Mast/stem cell growth factor receptor Kit (cKIT) Proto-oncogene tyrosine-protein kinase Kit Stem cell growth factor receptor Tyrosine-protein kinase Kit c-kit v-kit Hardy-Zuckerman 4 feline sarcoma viral oncogene homolog
Type:
Protein
Mol. Mass.:
109869.37
Organism:
Homo sapiens (Human)
Description:
P10721
Residue:
976
  
Inhibitor
Name:
BDBM239041
Synonyms:
US10028934, Compound 41 US9408850, 41 | US9597317, 41
Type:
Small organic molecule
Emp. Form.:
C30H35N5O4
Mol. Mass.:
529.63
SMILES:
CN(C1CC[N+](C)([O-])CC1)c1ccc(cc1)C(=O)Nc1n[nH]c2cc(OCCOCc3ccccc3)ccc12
: