Target
Receptor-type tyrosine-protein kinase FLT3
Ligand
BDBM239042
Substrate
Meas. Tech.
FLT3 Kinase Biochemical Assay
pH
7.9±n/a
IC50
<50.0±n/a nM
Comments
extracted
Citation
 Lombardi Borgia, ACiomei, MDonati, DNesi, M Substituted indazole derivatives active as kinase inhibitiors US Patent  US10028934 Publication Date 7/24/2018 
Target
Name:
Receptor-type tyrosine-protein kinase FLT3
Synonyms:
CD135 FL cytokine receptor FLK2 FLT3 Fetal liver kinase-2 Fms-like tyrosine kinase 3 (Flt-3) STK-1 Stem cell tyrosine kinase 1
Type:
Enzyme
Mol. Mass.:
112888.62
Organism:
Homo sapiens (Human)
Description:
P36888
Residue:
993
  
Inhibitor
Name:
BDBM239042
Synonyms:
US10028934, Compound 42 US9408850, 42 | US9597317, 42
Type:
Small organic molecule
Emp. Form.:
C29H30F3N5O4
Mol. Mass.:
569.5748
SMILES:
C[N+]1([O-])CCN(CC1)c1ccc(cc1)C(=O)Nc1n[nH]c2cc(OCCOCc3ccc(cc3)C(F)(F)F)ccc12
: