Target
Nuclear receptor subfamily 0 group B member 1
Ligand
BDBM97215
Substrate
IC50
>278.07±n/a nM
Citation
 PubChem, PC Luminescence-based cell-based high throughput dose response assay for inhibitors of the orphan nuclear receptor subfamily 0, group B, member 1 (DAX1; NR0B1): repression of SF-1 (NR5A1) activated StAR promoter by full-length DAX-1 PubChem Bioassay (2013)[AID] 
Target
Name:
Nuclear receptor subfamily 0 group B member 1
Synonyms:
AHC NR0B1 | NR0B1_HUMAN
Type:
Enzyme Catalytic Domain
Mol. Mass.:
51729.22
Organism:
Homo sapiens (Human)
Description:
gi_5016090
Residue:
470
  
Inhibitor
Name:
BDBM97215
Synonyms:
MLS000711397 N-[2-(4-methoxyphenyl)-6-methyl-benzotriazol-5-yl]acetamide N-[2-(4-methoxyphenyl)-6-methylbenzotriazol-5-yl]acetamide cid_738084
Type:
Small organic molecule
Emp. Form.:
C16H16N4O2
Mol. Mass.:
296.3238
SMILES:
COc1ccc(cc1)-n1nc2cc(C)c(NC(C)=O)cc2n1
: