Target
Nuclear receptor subfamily 0 group B member 1
Ligand
BDBM49933
Substrate
IC50
>67547±n/a nM
Citation
 PubChem, PC Luminescence-based cell-based high throughput dose response assay for inhibitors of the orphan nuclear receptor subfamily 0, group B, member 1 (DAX1; NR0B1): repression of SF-1 (NR5A1) activated StAR promoter by full-length DAX-1 PubChem Bioassay (2013)[AID] 
Target
Name:
Nuclear receptor subfamily 0 group B member 1
Synonyms:
AHC NR0B1 | NR0B1_HUMAN
Type:
Enzyme Catalytic Domain
Mol. Mass.:
51729.22
Organism:
Homo sapiens (Human)
Description:
gi_5016090
Residue:
470
  
Inhibitor
Name:
BDBM49933
Synonyms:
6-methoxy-2-(4-methoxyphenyl)-1-benzopyran-4-one 6-methoxy-2-(4-methoxyphenyl)chromone SMR000386953 | cid_688670
Type:
Small organic molecule
Emp. Form.:
C17H14O4
Mol. Mass.:
282.2907
SMILES:
COc1ccc(cc1)-c1cc(=O)c2cc(OC)ccc2o1
: