Target
Steroidogenic factor 1
Ligand
BDBM97225
Substrate
IC50
>67479±n/a nM
Citation
 PubChem, PC Counterscreen for inhibitors of the orphan nuclear receptor subfamily 0, group B, member 1 (DAX1; NR0B1): Luminescence-based cell-based high throughput dose response assay for nonselective inhibitors/assay artifacts using AP2 mutant SF-1 (NR5A1) Transactivation Assay PubChem Bioassay (2013)[AID] 
Target
Name:
Steroidogenic factor 1
Synonyms:
AD4BP FTZF1 NR5A1 SF-1 STF-1 Steroid hormone receptor Ad4BP
Type:
Nuclear Hormone Receptor
Mol. Mass.:
51643.43
Organism:
Homo sapiens (Human)
Description:
Residue:
461
  
Inhibitor
Name:
BDBM97225
Synonyms:
MLS001004920 N-[(E)-3-thiophenylmethylideneamino]-2-pyridinecarboxamide SMR000348485 | cid_6894275
Type:
Small organic molecule
Emp. Form.:
C11H9N3OS
Mol. Mass.:
231.274
SMILES:
O=C(N\N=C\c1ccsc1)c1ccccn1
: