Target
Steroidogenic factor 1
Ligand
BDBM38872
Substrate
IC50
>67537±n/a nM
Citation
 PubChem, PC Counterscreen for inhibitors of the orphan nuclear receptor subfamily 0, group B, member 1 (DAX1; NR0B1): Luminescence-based cell-based high throughput dose response assay for nonselective inhibitors/assay artifacts using AP2 mutant SF-1 (NR5A1) Transactivation Assay PubChem Bioassay (2013)[AID] 
Target
Name:
Steroidogenic factor 1
Synonyms:
AD4BP FTZF1 NR5A1 SF-1 STF-1 Steroid hormone receptor Ad4BP
Type:
Nuclear Hormone Receptor
Mol. Mass.:
51643.43
Organism:
Homo sapiens (Human)
Description:
Residue:
461
  
Inhibitor
Name:
BDBM38872
Synonyms:
MLS000069706 VINCRISTINE SULFATE | cid_5388992
Type:
Small organic molecule
Emp. Form.:
C46H56N4O10
Mol. Mass.:
824.9576
SMILES:
CC[C@]1(O)C[C@@H]2CN(C1)CCc1c([nH]c3ccccc13)[C@@](C2)(C(=O)OC)c1cc2c(cc1OC)N(C=O)[C@@H]1[C@]22CCN3CC=C[C@](CC)([C@@H]23)[C@@H](OC(C)=O)[C@]1(O)C(=O)OC
: