Target
Enoyl-acyl carrier reductase
Ligand
BDBM97424
Substrate
Meas. Tech.
Fabl Assay
pH
7.4±0
IC50
7e+3±n/a nM
Citation
 Samal, RPKhedkar, VMPissurlenkar, RRBwalya, AGTasdemir, DJoshi, RARajamohanan, PRPuranik, VGCoutinho, EC Design, Synthesis, Structural Characterization by IR, (1) H, (13) C, (15) N, 2D-NMR, X-Ray Diffraction and Evaluation of a New Class of Phenylaminoacetic Acid Benzylidene Hydrazines as pfENR Inhibitors. Chem Biol Drug Des 81:715-29 (2013)  
Target
Name:
Enoyl-acyl carrier reductase
Synonyms:
Enoyl-ACP reductase (ENR)
Type:
Protein
Mol. Mass.:
49835.97
Organism:
Plasmodium falciparum
Description:
Q9BH77
Residue:
432
  
Inhibitor
Name:
BDBM97424
Synonyms:
Phenylaminoacetic acid benzylidene hydrazine analog, 17
Type:
Small molecule
Emp. Form.:
C15H13BrClN3O
Mol. Mass.:
366.64
SMILES:
Clc1ccc(NCC(=O)N\N=C\c2cccc(Br)c2)cc1
: