Target
Enoyl-acyl carrier reductase
Ligand
BDBM97425
Substrate
Meas. Tech.
Fabl Assay
pH
7.4±0
IC50
1.63e+5±n/a nM
Citation
 Samal, RPKhedkar, VMPissurlenkar, RRBwalya, AGTasdemir, DJoshi, RARajamohanan, PRPuranik, VGCoutinho, EC Design, Synthesis, Structural Characterization by IR, (1) H, (13) C, (15) N, 2D-NMR, X-Ray Diffraction and Evaluation of a New Class of Phenylaminoacetic Acid Benzylidene Hydrazines as pfENR Inhibitors. Chem Biol Drug Des 81:715-29 (2013)  
Target
Name:
Enoyl-acyl carrier reductase
Synonyms:
Enoyl-ACP reductase (ENR)
Type:
Protein
Mol. Mass.:
49835.97
Organism:
Plasmodium falciparum
Description:
Q9BH77
Residue:
432
  
Inhibitor
Name:
BDBM97425
Synonyms:
Phenylaminoacetic acid benzylidene hydrazine analog, 18
Type:
Small molecule
Emp. Form.:
C15H13ClFN3O
Mol. Mass.:
305.735
SMILES:
Fc1ccc(NCC(=O)N\N=C\c2ccccc2Cl)cc1
: