Target
Farnesyl pyrophosphate synthase
Ligand
BDBM97429
Substrate
Meas. Tech.
Inhibition Assay
pH
7.4±0
Temperature
298.15±0 K
IC50
1.09e+5±n/a nM
Citation
 Lindert, SZhu, WLiu, YLPang, ROldfield, EMcCammon, JA Farnesyl diphosphate synthase inhibitors from in silico screening. Chem Biol Drug Des 81:742-8 (2013)  
Target
Name:
Farnesyl pyrophosphate synthase
Synonyms:
Dimethylallyltranstransferase FPP synthase FPPS_HUMAN Farnesyl diphosphate synthase Farnesyl diphosphate synthetase Farnesyl pyrophosphate synthetase KIAA1293 | P14324
Type:
Enzyme
Mol. Mass.:
48272.89
Organism:
Homo sapiens (Human)
Description:
P14324
Residue:
419
  
Inhibitor
Name:
BDBM97429
Synonyms:
60340, 13
Type:
Small molecule
Emp. Form.:
C26H25N7O4
Mol. Mass.:
499.5212
SMILES:
O[NH+]([O-])c1cc(ccc1C(=O)Nc1ccc(cc1)C1=NCCN1)C(=O)Nc1ccc(cc1)C1=NCCN1
: