Target
Farnesyl pyrophosphate synthase
Ligand
BDBM97435
Substrate
Meas. Tech.
Inhibition Assay
pH
7.4±0
Temperature
298.15±0 K
IC50
1.37e+4±n/a nM
Citation
 Lindert, SZhu, WLiu, YLPang, ROldfield, EMcCammon, JA Farnesyl diphosphate synthase inhibitors from in silico screening. Chem Biol Drug Des 81:742-8 (2013)  
Target
Name:
Farnesyl pyrophosphate synthase
Synonyms:
Dimethylallyltranstransferase FPP synthase FPPS_HUMAN Farnesyl diphosphate synthase Farnesyl diphosphate synthetase Farnesyl pyrophosphate synthetase KIAA1293 | P14324
Type:
Enzyme
Mol. Mass.:
48272.89
Organism:
Homo sapiens (Human)
Description:
P14324
Residue:
419
  
Inhibitor
Name:
BDBM97435
Synonyms:
35839, 19
Type:
Small molecule
Emp. Form.:
C26H24N6O2
Mol. Mass.:
452.5078
SMILES:
O=C(Nc1cccc(c1)C1=NCCN1)c1ccc(cc1)C(=O)Nc1cccc(c1)C1=NCCN1
: