Target
Tyrosine-protein kinase JAK1
Ligand
BDBM279811
Substrate
Meas. Tech.
Biochemical JAK Kinase Assay
pH
7.5±n/a
Ki
0.55±n/a nM
Comments
extracted
Citation
 Hudson, RKozak, JFleury, MFatheree, PRBeausoleil, APodesto, DD Pyrimidine compounds as JAK kinase inhibitors US Patent  US10028960 Publication Date 7/24/2018 
Target
Name:
Tyrosine-protein kinase JAK1
Synonyms:
JAK-1 JAK1A JAK1_HUMAN Janus kinase 1 (JAK1) | Janus kinase 1 JAK1
Type:
Protein
Mol. Mass.:
133293.73
Organism:
Homo sapiens (Human)
Description:
P23458
Residue:
1154
  
Inhibitor
Name:
BDBM279811
Synonyms:
(3-((6-methoxy-2-(methyl((1R,3s,5S)-9-(methylsulfonyl)-9-azabicyclo[3.3.1]nonan-3-yl)amino)pyrimidin-4-yl)amino)-1H-pyrazol-5-yl)methanol US10485803, Example 3 | US11110095, Example 3
Type:
Small organic molecule
Emp. Form.:
C19H29N7O4S
Mol. Mass.:
451.543
SMILES:
COc1cc(Nc2cc(CO)[nH]n2)nc(n1)N(C)[C@H]1C[C@@H]2CCC[C@H](C1)N2S(C)(=O)=O
: