Target
Tyrosine-protein kinase JAK2
Ligand
BDBM279813
Substrate
Meas. Tech.
Biochemical JAK Kinase Assay
pH
7.5±n/a
Ki
0.55±n/a nM
Comments
extracted
Citation
 Hudson, RKozak, JFleury, MFatheree, PRBeausoleil, APodesto, DD Pyrimidine compounds as JAK kinase inhibitors US Patent  US10028960 Publication Date 7/24/2018 
Target
Name:
Tyrosine-protein kinase JAK2
Synonyms:
JAK-2 JAK2_HUMAN Janus kinase 2 (JAK2) | Janus kinase 2 (a protein tyrosine kinase)
Type:
Protein
Mol. Mass.:
130684.68
Organism:
Homo sapiens (Human)
Description:
O60674
Residue:
1132
  
Inhibitor
Name:
BDBM279813
Synonyms:
3-((1R,3s,5S)-3-((4-((5-(hydroxymethyl)-1H-pyrazol-3-yl)amino)-6-methoxypyrimidin-2-yl)(methyl)amino)-8-azabicyclo[3.2.1]octan-8-yl)-propanenitrile US10485803, Example 5 | US11110095, Example 5
Type:
Small organic molecule
Emp. Form.:
C20H28N8O2
Mol. Mass.:
412.4887
SMILES:
COc1cc(Nc2cc(CO)[nH]n2)nc(n1)N(C)[C@H]1C[C@@H]2CC[C@H](C1)N2CCC#N
: