Target
Non-receptor tyrosine-protein kinase TYK2
Ligand
BDBM279816
Substrate
Meas. Tech.
Biochemical JAK Kinase Assay
pH
7.5±n/a
Ki
0.55±n/a nM
Comments
extracted
Citation
 Hudson, RKozak, JFleury, MFatheree, PRBeausoleil, APodesto, DD Pyrimidine compounds as JAK kinase inhibitors US Patent  US10028960 Publication Date 7/24/2018 
Target
Name:
Non-receptor tyrosine-protein kinase TYK2
Synonyms:
Non-receptor tyrosine-protein kinase TYK2 (TYK2) TYK2_HUMAN | Tyrosine-protein kinase TYK2
Type:
Protein
Mol. Mass.:
133666.03
Organism:
Homo sapiens (Human)
Description:
P29597
Residue:
1187
  
Inhibitor
Name:
BDBM279816
Synonyms:
Isobutyl (1R,3s,5S)-3-((4-((5-(hydroxymethyl)-1H-pyrazol-3-yl)amino)-6-methoxypyrimidin-2-yl)(methyl)amino)-9-azabicyclo[3.3.1]nonane-9-carboxylate US10485803, Example 8 | US11110095, Example 8
Type:
Small organic molecule
Emp. Form.:
C23H35N7O4
Mol. Mass.:
473.5685
SMILES:
COc1cc(Nc2cc(CO)[nH]n2)nc(n1)N(C)[C@H]1C[C@@H]2CCC[C@H](C1)N2C(=O)OCC(C)C
: