Target
Tyrosine-protein kinase JAK1
Ligand
BDBM279836
Substrate
Meas. Tech.
Biochemical JAK Kinase Assay
pH
7.5±n/a
Ki
0.55±n/a nM
Comments
extracted
Citation
 Hudson, RKozak, JFleury, MFatheree, PRBeausoleil, APodesto, DD Pyrimidine compounds as JAK kinase inhibitors US Patent  US10028960 Publication Date 7/24/2018 
Target
Name:
Tyrosine-protein kinase JAK1
Synonyms:
JAK-1 JAK1A JAK1_HUMAN Janus kinase 1 (JAK1) | Janus kinase 1 JAK1
Type:
Protein
Mol. Mass.:
133293.73
Organism:
Homo sapiens (Human)
Description:
P23458
Residue:
1154
  
Inhibitor
Name:
BDBM279836
Synonyms:
US10028960, Example 1-19 US11110095, Example 1-19
Type:
Small organic molecule
Emp. Form.:
C23H29FN8O4S
Mol. Mass.:
532.591
SMILES:
COc1cc(Nc2cc(CO)[nH]n2)nc(n1)N(C)[C@H]1C[C@@H]2CCC[C@H](C1)N2S(=O)(=O)c1cncc(F)c1
: