Target
Tyrosine-protein kinase JAK1
Ligand
BDBM279841
Substrate
Meas. Tech.
Biochemical JAK Kinase Assay
pH
7.5±n/a
Ki
0.55±n/a nM
Comments
extracted
Citation
 Hudson, RKozak, JFleury, MFatheree, PRBeausoleil, APodesto, DD Pyrimidine compounds as JAK kinase inhibitors US Patent  US10028960 Publication Date 7/24/2018 
Target
Name:
Tyrosine-protein kinase JAK1
Synonyms:
JAK-1 JAK1A JAK1_HUMAN Janus kinase 1 (JAK1) | Janus kinase 1 JAK1
Type:
Protein
Mol. Mass.:
133293.73
Organism:
Homo sapiens (Human)
Description:
P23458
Residue:
1154
  
Inhibitor
Name:
BDBM279841
Synonyms:
US10028960, Example 2-5 US11110095, Example 2-5
Type:
Small organic molecule
Emp. Form.:
C21H30N8O2
Mol. Mass.:
426.5153
SMILES:
COc1cc(Nc2cc(CO)[nH]n2)nc(n1)N(C)[C@H]1C[C@@H]2CCC[C@H](C1)N2CCC#N
: