Target
Substance-K receptor
Ligand
BDBM97488
Substrate
Meas. Tech.
Human NK2 Receptor Binding Assay
pH
7.5±n/a
IC50
0.55±0.0 nM
Comments
extracted
Citation
 Ikeura, YShirai, JSugiyama, HNishikimi, YKamei, TSakauchi, N Nitrogen-containing heterocyclic compound and use thereof US Patent  US8470816 Publication Date 6/25/2013 
Target
Name:
Substance-K receptor
Synonyms:
NK-2 receptor NK2R NKNAR Neurokinin A receptor Neurokinin-2 (NK-2) SKR TACR2 Tachykinin receptor 2 (NK2) | hnk-3
Type:
Protein
Mol. Mass.:
44455.78
Organism:
Homo sapiens (Human)
Description:
P21452
Residue:
398
  
Inhibitor
Name:
BDBM97488
Synonyms:
US8470816, 629
Type:
Small molecule
Emp. Form.:
C16H15ClO3
Mol. Mass.:
290.742
SMILES:
CCOc1cc(C=O)ccc1OCc1ccc(Cl)cc1
: