Target
Acetyl-CoA carboxylase 2 [151-2458]
Ligand
BDBM50332555
Substrate
Meas. Tech.
Luminometric Assay
pH
7.5±0
Temperature
310.15±0 K
IC50
2e+2±n/a nM
Citation
 Zoller, GSchmoll, DMueller, MHaschke, GFocken, I Heterocyclic compounds, processes for their preparation, medicaments comprising these compounds, and the use thereof US Patent  US8470841 Publication Date 6/25/2013 
Target
Name:
Acetyl-CoA carboxylase 2 [151-2458]
Synonyms:
ACACB ACC2 Acetyl-CoA carboxylase 2 (ACC2)
Type:
Protein
Mol. Mass.:
260677.17
Organism:
Homo sapiens (Human)
Description:
O00763 aa 1-150 removed
Residue:
2308
  
Inhibitor
Name:
BDBM50332555
Synonyms:
CHEMBL1630705 trans-N-(3-(5-(4-(cyclopentyloxy)phenoxy)-1,3-dioxan-2-yl)propyl)acetamide
Type:
Small organic molecule
Emp. Form.:
C20H29NO5
Mol. Mass.:
363.448
SMILES:
CC(=O)NCCC[C@H]1OC[C@@H](CO1)Oc1ccc(OC2CCCC2)cc1
: