Target
Acetyl-CoA carboxylase 2 [151-2458]
Ligand
BDBM50332549
Substrate
Meas. Tech.
Luminometric Assay
pH
7.5±0
Temperature
310.15±0 K
IC50
2e+2±n/a nM
Citation
 Zoller, GSchmoll, DMueller, MHaschke, GFocken, I Heterocyclic compounds, processes for their preparation, medicaments comprising these compounds, and the use thereof US Patent  US8470841 Publication Date 6/25/2013 
Target
Name:
Acetyl-CoA carboxylase 2 [151-2458]
Synonyms:
ACACB ACC2 Acetyl-CoA carboxylase 2 (ACC2)
Type:
Protein
Mol. Mass.:
260677.17
Organism:
Homo sapiens (Human)
Description:
O00763 aa 1-150 removed
Residue:
2308
  
Inhibitor
Name:
BDBM50332549
Synonyms:
(S)-N-(4-(4-(5-isopropoxypyridin-2-yloxy)phenyl)butan-2-yl)acetamide US8470841, 31
Type:
Small organic molecule
Emp. Form.:
C20H26N2O3
Mol. Mass.:
342.432
SMILES:
CC(C)Oc1ccc(Oc2ccc(CC[C@H](C)NC(C)=O)cc2)nc1
: