Target
Acetyl-CoA carboxylase 1
Ligand
BDBM97624
Substrate
Meas. Tech.
Luminometric Assay
pH
7.5±0
Temperature
310.15±0 K
IC50
>1.0e+4±n/a nM
Citation
 Zoller, GSchmoll, DMueller, MHaschke, GFocken, I Heterocyclic compounds, processes for their preparation, medicaments comprising these compounds, and the use thereof US Patent  US8470841 Publication Date 6/25/2013 
Target
Name:
Acetyl-CoA carboxylase 1
Synonyms:
ACACA_RAT Acac Acetyl-CoA carboxylase Acetyl-CoA carboxylase 1 (ACC1)
Type:
Protein
Mol. Mass.:
265183.92
Organism:
Rattus norvegicus (Rat)
Description:
P11497
Residue:
2345
  
Inhibitor
Name:
BDBM97624
Synonyms:
US8470841, 59
Type:
Small organic molecule
Emp. Form.:
C20H25NO4
Mol. Mass.:
343.4168
SMILES:
CC(C)Oc1ccc(Oc2ccc(OC[C@H](C)NC(C)=O)cc2)cc1
: