Target
Hormone-sensitive lipase
Ligand
BDBM97635
Substrate
Meas. Tech.
HSL Enzyme Assay
pH
7.2±0
Temperature
277.15±0 K
IC50
5e+1±n/a nM
Citation
 Ackermann, JConte, AHunziker, DNeidhart, WNettekoven, MSchulz-Gasch, TWertheimer, S Azacyclic compounds US Patent  US8470843 Publication Date 6/25/2013 
Target
Name:
Hormone-sensitive lipase
Synonyms:
HSL Hormone-sensitive lipase (HSL) LIPS_HUMAN
Type:
Protein
Mol. Mass.:
116599.07
Organism:
Homo sapiens (Human)
Description:
Q05469
Residue:
1076
  
Inhibitor
Name:
BDBM97635
Synonyms:
US8470843, 11
Type:
Small organic molecule
Emp. Form.:
C21H25F3N4O5S
Mol. Mass.:
502.507
SMILES:
CC(Oc1ccc(cc1)N1CCC2(CCN(CC2O)S(=O)(=O)c2ccnn2C)C1=O)C(F)(F)F
: